Last 50 log lines of gnu:octave-default:tarball build 6694819

mv poly.texi-t poly.texi
building quad.texi
perl ./munge-texi.pl ../.. ../../scripts/DOCSTRINGS ../../libinterp/DOCSTRINGS < quad.txi > quad.texi-t
mv quad.texi-t quad.texi
building set.texi
perl ./munge-texi.pl ../.. ../../scripts/DOCSTRINGS ../../libinterp/DOCSTRINGS < set.txi > set.texi-t
mv set.texi-t set.texi
building signal.texi
perl ./munge-texi.pl ../.. ../../scripts/DOCSTRINGS ../../libinterp/DOCSTRINGS < signal.txi > signal.texi-t
mv signal.texi-t signal.texi
building sparse.texi
perl ./munge-texi.pl ../.. ../../scripts/DOCSTRINGS ../../libinterp/DOCSTRINGS < sparse.txi > sparse.texi-t
mv sparse.texi-t sparse.texi
building stats.texi
perl ./munge-texi.pl ../.. ../../scripts/DOCSTRINGS ../../libinterp/DOCSTRINGS < stats.txi > stats.texi-t
mv stats.texi-t stats.texi
building stmt.texi
perl ./munge-texi.pl ../.. ../../scripts/DOCSTRINGS ../../libinterp/DOCSTRINGS < stmt.txi > stmt.texi-t
mv stmt.texi-t stmt.texi
building strings.texi
perl ./munge-texi.pl ../.. ../../scripts/DOCSTRINGS ../../libinterp/DOCSTRINGS < strings.txi > strings.texi-t
mv strings.texi-t strings.texi
building system.texi
perl ./munge-texi.pl ../.. ../../scripts/DOCSTRINGS ../../libinterp/DOCSTRINGS < system.txi > system.texi-t
mv system.texi-t system.texi
building testfun.texi
perl ./munge-texi.pl ../.. ../../scripts/DOCSTRINGS ../../libinterp/DOCSTRINGS < testfun.txi > testfun.texi-t
mv testfun.texi-t testfun.texi
building tips.texi
perl ./munge-texi.pl ../.. ../../scripts/DOCSTRINGS ../../libinterp/DOCSTRINGS < tips.txi > tips.texi-t
mv tips.texi-t tips.texi
building var.texi
perl ./munge-texi.pl ../.. ../../scripts/DOCSTRINGS ../../libinterp/DOCSTRINGS < var.txi > var.texi-t
mv var.texi-t var.texi
building vectorize.texi
perl ./munge-texi.pl ../.. ../../scripts/DOCSTRINGS ../../libinterp/DOCSTRINGS < vectorize.txi > vectorize.texi-t
mv vectorize.texi-t vectorize.texi
building voronoi.eps
../../run-octave -f -q -H -p . --eval "geometryimages ('voronoi', 'eps');"
octave: failed to exec '/tmp/nix-build-octave-tarball-0preb5d58667d32d.drv-0/hg-archive/src/octave-gui'
make[3]: *** [voronoi.eps] Error 1
make[3]: Leaving directory `/tmp/nix-build-octave-tarball-0preb5d58667d32d.drv-0/hg-archive/doc/interpreter'
make[2]: *** [all-recursive] Error 1
make[2]: Leaving directory `/tmp/nix-build-octave-tarball-0preb5d58667d32d.drv-0/hg-archive/doc'
make[1]: *** [all-recursive] Error 1
make[1]: Leaving directory `/tmp/nix-build-octave-tarball-0preb5d58667d32d.drv-0/hg-archive'
make: *** [all] Error 2
build time elapsed:  0m0.114s 0m0.032s 42m39.626s 4m20.464s
Copying build directory to /nix/store/fk0jf6d82pz1crpml2zqzmwdw89p2fbn-octave-tarball-0preb5d58667d32d/nix-build-octave-tarball-0preb5d58667d32d.drv-0
build failed with exit code 2 (ignored)